{"text_format":"1","workbook":"xlsx","n_sheets":16,"sheets":["Budget Template","Sheet1","BL & PSC Rates","Resource Type (budgeting)","How to \"Add Resource Line\"","How to \"Add New Activity\"","How to \"Add New Output\"","How to \"Delete Line(s)\"","ADD_RES_LINE","ADD_ACTIVITY","ADD_OUTPUT","Flagship Programmes","CP - SF Combinations_SQLdata","SQL - SF","SQL - CPO","SQL - SF & CPO"],"not_rendered":{"charts":0,"images":14,"macros":1,"external_links":4,"defined_names":20,"comments":0,"pivot_tables":0},"unopened":[],"bounds":{"document_bytes":16777216,"sheet_cells":100000,"rows_first":2000,"rows_last":500,"rows_between":2000,"halvings":0,"cell_chars":16384,"cell_head_chars":4096},"cells_cut":0,"cells_raw":0,"read":"whole","date_system":"1900"}

{"sheet":"Budget Template","index":0,"n_rows":128,"n_cols":37,"rows_kept":128,"cut":false,"hidden":false,"merged":[[116,4,118,4],[74,4,75,4],[76,4,77,4],[78,4,79,4],[80,4,81,4],[105,4,107,4],[20,34,21,34],[9,31,9,36],[11,0,11,6],[16,0,16,6],[9,10,9,15],[9,17,9,22],[9,24,9,29],[12,0,12,6],[14,0,14,6],[15,0,15,6],[13,0,13,6],[20,35,21,35],[20,36,21,36],[20,2,21,2],[20,3,21,3],[17,0,17,1],[17,7,17,9],[18,0,18,6],[20,11,21,11],[20,4,21,4],[20,28,21,28],[20,29,21,29],[20,31,21,31],[20,32,21,32],[20,33,21,33],[20,18,21,18],[20,19,21,19],[20,21,21,21],[20,22,21,22],[20,24,21,24],[20,25,21,25],[20,17,21,17],[20,12,21,12],[20,14,21,14],[20,15,21,15],[20,27,21,27],[20,13,21,13],[20,20,21,20],[121,0,124,0],[70,0,70,9],[72,0,81,0],[82,0,107,0],[116,1,118,1],[108,0,118,0],[20,26,21,26],[40,4,42,4],[43,4,45,4],[22,0,22,9],[26,2,28,2],[26,3,28,3],[29,2,31,2],[29,3,31,3],[32,2,34,2],[32,3,34,3],[59,2,61,2],[59,3,61,3],[62,2,64,2],[90,1,92,1],[120,0,120,9],[47,0,47,9],[84,1,86,1],[20,10,21,10],[110,1,112,1],[65,1,67,1],[49,0,56,0],[51,1,53,1],[57,0,67,0],[49,1,49,9],[57,1,57,9],[48,0,48,9],[93,4,95,4],[96,4,98,4],[99,4,101,4],[102,4,104,4],[110,4,112,4],[99,1,101,1],[96,1,98,1],[93,1,95,1],[113,4,115,4],[84,4,86,4],[87,4,89,4],[90,4,92,4],[119,0,119,9],[62,1,64,1],[46,0,46,9],[51,4,53,4],[54,4,56,4],[59,4,61,4],[62,4,64,4],[65,4,67,4],[87,1,89,1],[87,2,89,2],[87,3,89,3],[90,2,92,2],[90,3,92,3],[105,3,107,3],[84,2,86,2],[84,3,86,3],[93,2,95,2],[113,1,115,1],[105,1,107,1],[102,1,104,1],[23,0,23,9],[36,0,36,9],[37,0,37,9],[35,0,35,9],[24,0,34,0],[24,1,24,9],[26,1,28,1],[29,1,31,1],[32,1,34,1],[29,4,31,4],[32,4,34,4],[26,4,28,4],[40,1,42,1],[54,1,56,1],[59,1,61,1],[43,1,45,1],[69,0,69,9],[76,1,77,1],[74,1,75,1],[80,1,81,1],[78,1,79,1],[71,0,71,9],[7,10,8,10],[7,11,8,11],[110,2,112,2],[110,3,112,3],[113,2,115,2],[113,3,115,3],[116,2,118,2],[116,3,118,3],[74,2,75,2],[74,3,75,3],[76,2,77,2],[76,3,77,3],[78,2,79,2],[78,3,79,3],[80,2,81,2],[80,3,81,3],[93,3,95,3],[96,2,98,2],[96,3,98,3],[99,2,101,2],[99,3,101,3],[102,2,104,2],[102,3,104,3],[105,2,107,2],[7,33,8,33],[7,34,8,34],[7,35,8,35],[7,36,8,36],[1,2,1,6],[7,22,8,22],[7,24,8,24],[7,25,8,25],[7,26,8,26],[7,27,8,27],[7,28,8,28],[7,29,8,29],[7,31,8,31],[7,32,8,32],[7,12,8,12],[7,13,8,13],[7,14,8,14],[7,15,8,15],[7,17,8,17],[7,18,8,18],[7,19,8,19],[7,20,8,20],[7,21,8,21],[7,2,8,2],[4,2,4,5],[62,3,64,3],[65,2,67,2],[65,3,67,3],[68,0,68,9],[20,0,21,0],[20,1,21,1],[20,9,21,9],[20,7,21,8],[7,0,8,0],[7,1,8,1],[7,3,8,3],[7,4,8,4],[7,7,8,8],[7,9,8,9],[38,0,45,0],[40,2,42,2],[40,3,42,3],[43,2,45,2],[43,3,45,3],[51,2,53,2],[51,3,53,3],[54,2,56,2],[54,3,56,3]]}
["Award No.","502###"]
["PSC Rate","13%",{"$f":"VLOOKUP(B2,'BL & PSC Rates'!A$2:B$8,2,FALSE)","v":"Please select a different rate when a waiver has been requested and approved by the TREASURER, if the applicable rate is not in the list, go to the sheet \"BL & PSC Rates\" and enter the rate in cell A4"}]
["Project Number","108###"]
["XB Symbol"]
["Budget Version",null,"Please see the \"Result-based budgeting guide\", page 38 paragrah 99",null,null,null,null,null,null,null,null,null,null,null,null,{"$f":"P19+P19*0.01","v":1500000}]
["Is agreement subject to the 1% UN Coordination Levy?",null,"Yes"]
[]
["Output","Activity","CPO / GP","P&B Output","Flagship Programme(s)","Inputs","Type","Unit rate",null,"Quantity",{"$f":"K11","v":2024},{"$f":"L11","v":2025},2026,2027,2028,"Total",null,{"$f":"R11","v":2024},{"$f":"S11","v":2025},2026,2027,2028,"Total",null,{"$f":"Y11","v":2024},{"$f":"Z11","v":2025},2026,2027,2028,"Total",null,{"$f":"AF11","v":2024},{"$f":"AG11","v":2025},2026,2027,2028,"Total"]
[null,null,null,null,null,"(Assumptions)","Resource type* (IRIS)"]
[null,null,null,null,null,null,null,null,null,null,"Working (Draft) Budget",null,null,null,null,null,null,"Current/Baselined  Budget",null,null,null,null,null,null,"Comparison (Working Budget - Current/Baselined Budget)",null,null,null,null,null,null,"Budget to be entered in OGA"]
{"$rows_left_out":119}
{"sheet":"Sheet1","index":1,"n_rows":0,"n_cols":0,"rows_kept":0,"cut":false,"hidden":false,"merged":[]}

{"sheet":"BL & PSC Rates","index":2,"n_rows":8,"n_cols":4,"rows_kept":8,"cut":false,"hidden":false,"merged":[]}
["PSC Rate",null,null,"PSC BL"]
["13%","Please select a different rate when a waiver has been requested and approved by the TREASURER, if the applicable rate is not in the list, go to the sheet \"BL & PSC Rates\" and enter the rate in cell A4","13%","068.001"]
["13% & 0% DPTB","0% PSC for Direct Payment to Beneficiaries (Cash Transfers in response to COVID-19) and 13% on all other Expend Types",0.13,"068.001"]
["Another rate","Waiver approval should be obtained before submitting budget to the donor, enter the approved rate in cell A4 in sheet \"BL & PSC Rates\"",{"$f":"A4","v":"Another rate"},"067.001"]
["5%","Waiver approval should be obtained before submitting budget to the donor","5%","065.001"]
["12%","Waiver approval should be obtained before submitting budget to the donor","12%","064.001"]
["7%","Waiver approval should be obtained before submitting budget to the donor","7%","062.001"]
["14%","Waiver approval should be obtained before submitting budget to the donor","14%","061.001"]

{"sheet":"Resource Type (budgeting)","index":3,"n_rows":62,"n_cols":4,"rows_kept":62,"cut":false,"hidden":false,"merged":[]}
["Resource Categories","Resource Category Description","Resource Type (budgeting)","Resource Type Description"]
["010_ILO_INTERNATIONAL_STAFF","International Professional Staff","512100_ILO_EXPERTS_COSTS","Standard Costs for International Experts"]
["010_ILO_INTERNATIONAL_STAFF","International Professional Staff","512124_DSA_ST_STAFF","Daily Subsistence Allowance for Short-Term staff"]
["010_ILO_INTERNATIONAL_STAFF","International Professional Staff","515129_MISCELLANEOUS_PERSONNEL","Miscellaneous Personnel Costs"]
["010_ILO_INTERNATIONAL_STAFF","International Professional Staff","518202_ILO_EXPERTS_SST","Special Short-Term Contracts Int. Staff"]
["015_INT_CONSULTANTS","International Consultants","514175_INT_CONSULTANTS","International Consultants"]
["020_ILO_LOCAL_STAFF","Local Support Staff","518100_ADMIN_COST_AT_ACTUAL","Administrative support costs - salaries - Budget"]
["020_ILO_LOCAL_STAFF","Local Support Staff","518201_SST_CONTRACTS_GS_STAFF","Special Short Term - Contracts / General Service Staff"]
["024_NAT_OFFICERS","National Professional Staff","518115_NATIONAL_OFFICERS","National Officer based on Actuals"]
["025_NAT_CONSULTANTS","National Consultants","514170_NAT_CONSULTANTS","National Consultants"]
{"$rows_left_out":53}
{"sheet":"How to \"Add Resource Line\"","index":4,"n_rows":72,"n_cols":17,"rows_kept":72,"cut":false,"hidden":false,"merged":[]}
[]
["Select whole row where you need the additional line"]
["Do not select the fist line under the Activity, this to avoid loosing the borders layout"]
[]
[]
[]
[]
[]
[]
[]
{"$rows_left_out":63}
{"sheet":"How to \"Add New Activity\"","index":5,"n_rows":66,"n_cols":16,"rows_kept":66,"cut":false,"hidden":false,"merged":[[65,15,73,18]]}
[]
["Select the whole row where you need the additional activity"]
["Always select the fist line of an Activity, never a line in the middle."]
[]
[]
[]
[]
[]
[]
[]
{"$rows_left_out":57}
{"sheet":"How to \"Add New Output\"","index":6,"n_rows":68,"n_cols":32,"rows_kept":68,"cut":false,"hidden":false,"merged":[[18,31,19,34],[67,15,71,18]]}
[]
["You should always add the additional/new Output under the Outcome where it is required"]
["You shoud select the top line of an existing Output in that Outcome, never select a line in the middle of another Output"]
[]
[]
[]
[]
[]
[]
[]
{"$rows_left_out":59}
{"sheet":"How to \"Delete Line(s)\"","index":7,"n_rows":70,"n_cols":1,"rows_kept":70,"cut":false,"hidden":false,"merged":[]}
["Select the whole line, or lines, that you need to delete. "]
["If a whole Activity or Output needs to be deleted, it is better to select the entire Activity or Output."]
["CAUTION: You cannot undo this action."]
["Never delete an Outcome as this will break the PSC formulas"]
[]
[]
[]
[]
[]
[]
{"$rows_left_out":61}
{"sheet":"ADD_RES_LINE","index":8,"n_rows":5,"n_cols":37,"rows_kept":5,"cut":false,"hidden":false,"merged":[[1,13,2,13],[1,19,2,19],[1,0,2,0],[1,1,2,1],[1,7,2,8],[1,9,2,9],[1,10,2,10],[1,11,2,11],[1,12,2,12],[1,14,2,14],[1,15,2,15],[1,17,2,17],[1,18,2,18],[1,4,2,4],[1,2,2,2],[1,3,2,3],[1,20,2,20],[1,36,2,36],[1,21,2,21],[1,22,2,22],[1,24,2,24],[1,25,2,25],[1,26,2,26],[1,27,2,27],[1,29,2,29],[1,31,2,31],[1,32,2,32],[1,33,2,33],[1,34,2,34],[1,35,2,35],[1,28,2,28]]}
[]
["Output","Activity","CPO / GP","P&B Output","Flagship Programme(s)","Inputs","Type","Unit rate",null,"Quantity",{"$f":"'Budget Template'!K11","v":2024},{"$f":"'Budget Template'!L11","v":2025},{"$f":"'Budget Template'!M11","v":2026},{"$f":"'Budget Template'!N11","v":2027},{"$f":"'Budget Template'!O11","v":2028},"Total",null,{"$f":"'Budget Template'!R11","v":2024},{"$f":"'Budget Template'!S11","v":2025},{"$f":"'Budget Template'!T11","v":2026},{"$f":"'Budget Template'!U11","v":2027},{"$f":"'Budget Template'!V11","v":2028},"Total",null,{"$f":"'Budget Template'!Y11","v":2024},{"$f":"'Budget Template'!Z11","v":2025},{"$f":"'Budget Template'!AA11","v":2026},{"$f":"'Budget Template'!AB11","v":2027},{"$f":"'Budget Template'!AC11","v":2028},"Total",null,{"$f":"'Budget Template'!AF11","v":2024},{"$f":"'Budget Template'!AG11","v":2025},{"$f":"'Budget Template'!AH11","v":2026},{"$f":"'Budget Template'!AI11","v":2027},{"$f":"'Budget Template'!AJ11","v":2028},"Total"]
[null,null,null,null,null,"(Assumptions)","Resource type* (IRIS)"]
[]
[null,null,null,null,null,null,null,null,null,null,null,null,null,null,null,{"$f":"SUM(K5:O5)","v":0},null,null,null,null,null,null,null,null,{"$f":"K5-R5","v":0},{"$f":"L5-S5","v":0},{"$f":"M5-T5","v":0},{"$f":"N5-U5","v":0},{"$f":"O5-V5","v":0},{"$f":"SUM(Y5:AC5)","v":0},null,{"$f":"IF(K5=R5,\"\",IF(K5>R5,K5,-K5))","v":""},{"$f":"IF(L5=S5,\"\",IF(L5>S5,L5,-L5))","v":""},"","","",{"$f":"IF(COUNT(AF5:AJ5)=0,\"\",P5)","v":""}]

{"sheet":"ADD_ACTIVITY","index":9,"n_rows":7,"n_cols":37,"rows_kept":7,"cut":false,"hidden":false,"merged":[[1,27,2,27],[1,20,2,20],[1,13,2,13],[1,36,2,36],[1,28,2,28],[1,29,2,29],[1,31,2,31],[1,32,2,32],[1,33,2,33],[1,35,2,35],[1,34,2,34],[1,26,2,26],[1,18,2,18],[1,19,2,19],[1,21,2,21],[1,22,2,22],[4,1,6,1],[1,0,2,0],[1,1,2,1],[1,7,2,8],[1,9,2,9],[1,4,2,4],[4,4,6,4],[1,2,2,2],[1,3,2,3],[4,2,6,2],[4,3,6,3],[1,24,2,24],[1,25,2,25],[1,10,2,10],[1,11,2,11],[1,12,2,12],[1,14,2,14],[1,15,2,15],[1,17,2,17]]}
[]
["Output","Activity","CPO / GP","P&B Output","Flagship Programme(s)","Inputs","Type","Unit rate",null,"Quantity",{"$f":"'Budget Template'!K11","v":2024},{"$f":"'Budget Template'!L11","v":2025},{"$f":"'Budget Template'!M11","v":2026},{"$f":"'Budget Template'!N11","v":2027},{"$f":"'Budget Template'!O11","v":2028},"Total",null,{"$f":"'Budget Template'!R11","v":2024},{"$f":"'Budget Template'!S11","v":2025},{"$f":"'Budget Template'!T11","v":2026},{"$f":"'Budget Template'!U11","v":2027},{"$f":"'Budget Template'!V11","v":2028},"Total",null,{"$f":"'Budget Template'!Y11","v":2024},{"$f":"'Budget Template'!Z11","v":2025},{"$f":"'Budget Template'!AA11","v":2026},{"$f":"'Budget Template'!AB11","v":2027},{"$f":"'Budget Template'!AC11","v":2028},"Total",null,{"$f":"'Budget Template'!AF11","v":2024},{"$f":"'Budget Template'!AG11","v":2025},{"$f":"'Budget Template'!AH11","v":2026},{"$f":"'Budget Template'!AI11","v":2027},{"$f":"'Budget Template'!AJ11","v":2028},"Total"]
[null,null,null,null,null,"(Assumptions)","Resource type* (IRIS)"]
[]
[null,"0",null,null,null,null,null,null,null,null,null,null,null,null,null,{"$f":"SUM(K5:O5)","v":0},null,null,null,null,null,null,null,null,{"$f":"K5-R5","v":0},{"$f":"L5-S5","v":0},0,0,0,{"$f":"SUM(Y5:AC5)","v":0},null,{"$f":"IF(K5=R5,\"\",IF(K5>R5,K5,-K5))","v":""},{"$f":"IF(L5=S5,\"\",IF(L5>S5,L5,-L5))","v":""},"","","",{"$f":"IF(COUNT(AF5:AJ5)=0,\"\",P5)","v":""}]
[null,null,null,null,null,null,null,null,null,null,null,null,null,null,null,{"$f":"SUM(K6:O6)","v":0},null,null,null,null,null,null,null,null,{"$f":"K6-R6","v":0},0,0,0,0,{"$f":"SUM(Y6:AC6)","v":0},null,{"$f":"IF(K6=R6,\"\",IF(K6>R6,K6,-K6))","v":""},"","","","",{"$f":"IF(COUNT(AF6:AJ6)=0,\"\",P6)","v":""}]
[null,null,null,null,null,null,null,null,null,null,null,null,null,null,null,{"$f":"SUM(K7:O7)","v":0},null,null,null,null,null,null,null,null,{"$f":"K7-R7","v":0},0,0,0,0,{"$f":"SUM(Y7:AC7)","v":0},null,{"$f":"IF(K7=R7,\"\",IF(K7>R7,K7,-K7))","v":""},"","","","",{"$f":"IF(COUNT(AF7:AJ7)=0,\"\",P7)","v":""}]

{"sheet":"ADD_OUTPUT","index":10,"n_rows":18,"n_cols":37,"rows_kept":18,"cut":false,"hidden":false,"merged":[[1,20,2,20],[1,27,2,27],[1,34,2,34],[1,19,2,19],[1,0,2,0],[1,1,2,1],[1,7,2,8],[1,9,2,9],[1,10,2,10],[1,11,2,11],[1,12,2,12],[1,14,2,14],[1,15,2,15],[1,17,2,17],[1,18,2,18],[1,13,2,13],[1,36,2,36],[1,21,2,21],[1,22,2,22],[1,24,2,24],[1,25,2,25],[1,26,2,26],[1,28,2,28],[1,29,2,29],[1,31,2,31],[1,32,2,32],[1,33,2,33],[1,35,2,35],[4,0,17,0],[4,1,4,9],[6,1,8,1],[9,1,11,1],[12,1,14,1],[15,1,17,1],[9,2,11,2],[9,3,11,3],[12,2,14,2],[12,3,14,3],[15,2,17,2],[15,3,17,3],[6,4,8,4],[9,4,11,4],[12,4,14,4],[15,4,17,4],[1,2,2,2],[1,3,2,3],[1,4,2,4],[6,2,8,2],[6,3,8,3]]}
[]
["Output","Activity","CPO / GP","P&B Output","Flagship Programme(s)","Inputs","Type","Unit rate",null,"Quantity",{"$f":"'Budget Template'!K11","v":2024},{"$f":"'Budget Template'!L11","v":2025},{"$f":"'Budget Template'!M11","v":2026},{"$f":"'Budget Template'!N11","v":2027},{"$f":"'Budget Template'!O11","v":2028},"Total",null,{"$f":"'Budget Template'!R11","v":2024},{"$f":"'Budget Template'!S11","v":2025},{"$f":"'Budget Template'!T11","v":2026},{"$f":"'Budget Template'!U11","v":2027},{"$f":"'Budget Template'!V11","v":2028},"Total",null,{"$f":"'Budget Template'!Y11","v":2024},{"$f":"'Budget Template'!Z11","v":2025},{"$f":"'Budget Template'!AA11","v":2026},{"$f":"'Budget Template'!AB11","v":2027},{"$f":"'Budget Template'!AC11","v":2028},"Total",null,{"$f":"'Budget Template'!AF11","v":2024},{"$f":"'Budget Template'!AG11","v":2025},{"$f":"'Budget Template'!AH11","v":2026},{"$f":"'Budget Template'!AI11","v":2027},{"$f":"'Budget Template'!AJ11","v":2028},"Total"]
[null,null,null,null,null,"(Assumptions)","Resource type* (IRIS)"]
[]
["0",null,null,null,null,null,null,null,null,null,{"$f":"SUM(K6:K18)","v":0},{"$f":"SUM(L6:L18)","v":0},{"$f":"SUM(M6:M18)","v":0},0,0,{"$f":"SUM(K5:O5)","v":0},null,null,null,null,null,null,null,null,{"$f":"SUM(Y6:Y18)","v":0},{"$f":"SUM(Z6:Z18)","v":0},{"$f":"SUM(AA6:AA18)","v":0},0,0,{"$f":"SUM(Y5:AC5)","v":0},null,{"$f":"IF(COUNT(AF6:AF18)=0,\"\",K5)","v":""},{"$f":"IF(COUNT(AG6:AG18)=0,\"\",L5)","v":""},{"$f":"IF(COUNT(AH6:AH18)=0,\"\",M5)","v":""},{"$f":"IF(COUNT(AI6:AI18)=0,\"\",N5)","v":""},{"$f":"IF(COUNT(AJ6:AJ18)=0,\"\",O5)","v":""},{"$f":"IF(COUNT(AF5:AJ5)=0,\"\",P5)","v":""}]
[null,null,null,null,"DO NOT DELETE LINE"]
[null,"0",null,null,null,null,null,null,null,null,null,null,null,null,null,{"$f":"SUM(K7:O7)","v":0},null,null,null,null,null,null,null,null,{"$f":"K7-R7","v":0},{"$f":"L7-S7","v":0},0,0,0,{"$f":"SUM(Y7:AC7)","v":0},null,{"$f":"IF(K7=R7,\"\",IF(K7>R7,K7,-K7))","v":""},{"$f":"IF(L7=S7,\"\",IF(L7>S7,L7,-L7))","v":""},"","","",{"$f":"IF(COUNT(AF7:AJ7)=0,\"\",P7)","v":""}]
[null,null,null,null,null,null,null,null,null,null,null,null,null,null,null,{"$f":"SUM(K8:O8)","v":0},null,null,null,null,null,null,null,null,0,0,0,0,0,{"$f":"SUM(Y8:AC8)","v":0},null,"","","","","",""]
[null,null,null,null,null,null,null,null,null,null,null,null,null,null,null,{"$f":"SUM(K9:O9)","v":0},null,null,null,null,null,null,null,null,0,0,0,0,0,0,null,"","","","","",""]
[null,"0",null,null,null,null,null,null,null,null,null,null,null,null,null,{"$f":"SUM(K10:O10)","v":0},null,null,null,null,null,null,null,null,0,0,0,0,0,0,null,"","","","","",""]
{"$rows_left_out":9}
{"sheet":"Flagship Programmes","index":11,"n_rows":8,"n_cols":2,"rows_kept":8,"cut":false,"hidden":true,"merged":[]}
[]
["Flagship Programmes"]
["None","2021-10-07"]
["IPEC+","2021-10-07"]
["Building Social Protection Floors for All (SPF)","2021-10-07"]
["Safety and Health for All","2021-10-07"]
["Jobs for Peace and Resilience (JPR)","2021-10-07"]
["Better Work","2021-10-07"]

{"sheet":"CP - SF Combinations_SQLdata","index":12,"n_rows":2540,"n_cols":4,"rows_kept":2540,"cut":false,"hidden":true,"merged":[[0,0,0,3]]}
["CP/SF combination as at 27-May-2022"]
["CPO Value","CPO Description","SF Value","SF Description"]
["ABW101","Strengthened institutional capacity of employers' organizations",590011,"Output 1.1. Increased institutional capacity of employer and business membership organizations (EBMOs)"]
["AFG105","Entrepreneurship and enterprise development policies, strategies and programmes have increased access to decent jobs and incomes for women and men",590041,"Output 4.1. Increased capacity of Member States to create an enabling environment for entrepreneurship and sustainable enterprises"]
["AFG105","Entrepreneurship and enterprise development policies, strategies and programmes have increased access to decent jobs and incomes for women and men",590042,"Output 4.2. Strengthened capacity of enterprises and their support systems to enhance productivity and sustainability"]
["AFG105","Entrepreneurship and enterprise development policies, strategies and programmes have increased access to decent jobs and incomes for women and men",590043,"Output 4.3. Increased capacity of Member States to develop policies, legislation and other measures that are specifically aimed at facilitating the transition of enterprises to formality"]
["AFG105","Entrepreneurship and enterprise development policies, strategies and programmes have increased access to decent jobs and incomes for women and men",590044,"Output 4.4. Increased capacity of Member States and enterprises to develop policies and measures that promote the alignment of business practices with decent work and a human-centred approach to the future of work"]
["AFG106","Young men and women, including in the most vulnerable and disadvantaged groups, have acquired skills that are in demand",590052,"Output 5.2. Increased capacity of Member States to strengthen skills and lifelong learning policies, governance models and financing system"]
["AFG106","Young men and women, including in the most vulnerable and disadvantaged groups, have acquired skills that are in demand",590053,"Output 5.3. Increased capacity of Member States to design and deliver innovative, flexible and inclusive learning options, encompassing work-based learning and quality apprenticeships"]
["AFG126","The labour market statistics and information system has provided gender responsive, and evidence-based information and knowledge, and has promoted and planned for sustainable and decent work",710271,"Output A.1. Enhanced decent work statistics using innovative sources and statistical standards"]
{"$rows_left_out":2531}
{"sheet":"SQL - SF","index":13,"n_rows":10,"n_cols":1,"rows_kept":10,"cut":false,"hidden":false,"merged":[]}
["SF Values"]
[]
["select      sf_ind.flex_value                                   as \"SF Segment\""]
["            ,sf_ind.description                                 as \"SF Description\""]
["from        apps.xxsm_flex_values_tl sf_ind"]
["where       1=1"]
["and         sf_ind.context = 'IP22'"]
["and         sf_ind.flex_value_set_name = 'ILO_AFF_SF'"]
["and         length(sf_ind.flex_value) = '6'"]
["and         upper(sf_ind.description) like 'OUTPUT%'"]
{"$rows_left_out":1}
{"sheet":"SQL - CPO","index":14,"n_rows":64,"n_cols":1,"rows_kept":64,"cut":false,"hidden":true,"merged":[]}
["CPO Values"]
["select      cpo.flex_value                                                      as \"CPO Value\""]
["            ,REPLACE(REPLACE(REPLACE(REPLACE(cpo.description"]
["                ,CHR(13), ' '),CHR(10),''),CHR(9),''),'    ','')                as \"CPO Description\""]
["--            ,c.code"]
["--            ,xfvt1.description"]
["from        xxsm.xxsm_flex_value_link xfvl"]
["            ,xxsm.xxsm_context  cont"]
["            ,apps.fnd_lookup_values flv"]
["            ,xxsm.xxsm_flex_values_tl xfvt"]
{"$rows_left_out":55}
{"sheet":"SQL - SF & CPO","index":15,"n_rows":69,"n_cols":1,"rows_kept":69,"cut":false,"hidden":false,"merged":[]}
["SF & CPO Values"]
["select      cpo.flex_value                                                      as \"CPO Value\""]
["            ,REPLACE(REPLACE(REPLACE(REPLACE(REPLACE(cpo.description"]
["                ,CHR(13), ' '),CHR(10),''),CHR(9),''),CHR(34),''),'    ','')    as \"CPO Description\""]
["            ,c.code                                                             as \"SF Value\""]
["            ,REPLACE(REPLACE(REPLACE(REPLACE(REPLACE(xfvt1.description"]
["                ,CHR(13), ' '),CHR(10),''),CHR(9),''),CHR(34),''),'    ','')    as \"SF Description\""]
["from        xxsm.xxsm_flex_value_link xfvl"]
["            ,xxsm.xxsm_context  cont"]
["            ,apps.fnd_lookup_values flv"]
{"$rows_left_out":59}