{"text_format":"1","workbook":"xlsx","n_sheets":11,"sheets":["Budget Template","Budget Template (2)","BL & PSC Rates","How to \"Add Resource Line\"","How to \"Add New Activity\"","How to \"Add New Output\"","How to \"Delete Line(s)\"","ADD_RES_LINE","ADD_ACTIVITY","ADD_OUTPUT","Resource Type (budgeting)"],"not_rendered":{"charts":0,"images":14,"macros":1,"external_links":5,"defined_names":26,"comments":0,"pivot_tables":0},"unopened":[],"bounds":{"document_bytes":16777216,"sheet_cells":100000,"rows_first":2000,"rows_last":500,"rows_between":2000,"halvings":0,"cell_chars":16384,"cell_head_chars":4096},"cells_cut":0,"cells_raw":0,"read":"whole","date_system":"1900"}

{"sheet":"Budget Template","index":0,"n_rows":316,"n_cols":34,"rows_kept":316,"cut":false,"hidden":false,"merged":[[285,1,291,1],[272,1,275,1],[276,1,278,1],[234,1,236,1],[199,1,201,1],[211,1,213,1],[214,1,216,1],[217,1,219,1],[220,0,236,0],[220,1,220,6],[238,0,238,6],[142,1,142,6],[150,1,150,6],[147,1,149,1],[222,1,224,1],[228,1,230,1],[231,1,233,1],[161,1,161,6],[175,1,175,6],[183,1,185,1],[158,0,158,6],[160,0,160,6],[194,0,194,6],[150,0,157,0],[152,1,154,1],[155,1,157,1],[1,2,1,9],[16,0,16,1],[16,4,16,6],[17,0,17,3],[19,0,20,0],[19,1,20,1],[19,6,20,6],[19,4,20,5],[19,7,20,7],[19,8,20,8],[5,28,5,33],[7,0,7,3],[15,0,15,3],[5,7,5,12],[5,14,5,19],[5,21,5,26],[8,0,8,3],[9,0,9,3],[10,0,10,3],[14,0,14,3],[12,0,12,4],[11,0,11,4],[13,0,13,4],[19,32,20,32],[19,33,20,33],[21,0,21,6],[23,0,30,0],[23,1,23,6],[28,1,30,1],[19,23,20,23],[19,25,20,25],[19,26,20,26],[19,28,20,28],[19,29,20,29],[19,30,20,30],[19,15,20,15],[19,16,20,16],[19,18,20,18],[19,19,20,19],[19,21,20,21],[19,22,20,22],[19,14,20,14],[19,9,20,9],[19,11,20,11],[19,12,20,12],[25,1,27,1],[19,24,20,24],[305,0,308,0],[128,0,141,0],[159,0,159,6],[120,0,127,0],[81,0,81,6],[237,0,237,6],[239,0,263,0],[264,0,294,0],[122,1,124,1],[130,1,132,1],[139,1,141,1],[100,0,116,0],[94,1,96,1],[97,1,99,1],[102,1,104,1],[108,1,110,1],[111,1,113,1],[114,1,116,1],[142,0,149,0],[144,1,146,1],[304,0,304,6],[175,0,193,0],[177,1,179,1],[180,1,182,1],[133,1,135,1],[136,1,138,1],[118,0,118,6],[83,0,99,0],[85,1,87,1],[91,1,93,1],[125,1,127,1],[128,1,128,6],[49,0,68,0],[51,1,54,1],[64,1,68,1],[55,1,57,1],[58,1,60,1],[69,0,79,0],[71,1,73,1],[77,1,79,1],[49,1,49,6],[69,1,69,6],[61,1,63,1],[39,0,46,0],[36,1,38,1],[47,0,47,6],[19,31,20,31],[83,1,83,6],[100,1,100,6],[120,1,120,6],[19,10,20,10],[19,17,20,17],[74,1,76,1],[39,1,39,6],[41,1,43,1],[44,1,46,1],[22,0,22,6],[117,0,117,6],[119,0,119,6],[31,0,38,0],[31,1,31,6],[33,1,35,1],[48,0,48,6],[80,0,80,6],[82,0,82,6],[88,1,90,1],[105,1,107,1],[303,0,303,6],[186,1,188,1],[266,1,268,1],[292,1,294,1],[297,1,299,1],[300,1,302,1],[189,1,193,1],[161,0,174,0],[163,1,165,1],[166,1,168,1],[169,1,171,1],[172,1,174,1],[208,1,210,1],[205,1,207,1],[202,1,204,1],[225,1,227,1],[195,0,195,6],[196,0,196,6],[197,0,219,0],[197,1,197,6],[295,0,302,0],[269,1,271,1],[279,1,281,1],[282,1,284,1]]}
["Award No.","502###"]
["PSC Rate",{"$f":"VLOOKUP(B308,'BL & PSC Rates'!A$2:C$7,2,FALSE)","v":0.13}]
["Project Number","107###"]
["XB Symbol","GLO/20/29/BEL "]
["Budget Version","V.01.00"]
[null,null,null,null,null,null,null,"Working (Draft) Budget",null,null,null,null,null,null,"Current/Baselined  Budget",null,null,null,null,null,null,"Comparison (Working Budget - Current/Baselined Budget)",null,null,null,null,null,null,"Budget to be entered in OGA"]
["Task Number",null,null,null,null,null,null,2020,{"$f":"H7+1","v":2021},{"$f":"I7+1","v":2022},2023,2024,"Total",null,{"$f":"H7","v":2020},{"$f":"I7","v":2021},{"$f":"J7","v":2022},{"$f":"K7","v":2023},2024,"Total",null,{"$f":"O7","v":2020},{"$f":"P7","v":2021},{"$f":"Q7","v":2022},{"$f":"R7","v":2023},2024,"Total",null,{"$f":"V7","v":2020},{"$f":"W7","v":2021},{"$f":"X7","v":2022},{"$f":"Y7","v":2023},2024,"Total"]
["Total Project Level",null,null,null,null,null,null,{"$f":"SUM(H9:H17)","v":430854.5},{"$f":"SUM(I9:I17)","v":1492892},{"$f":"SUM(J9:J17)","v":326253.5},{"$f":"SUM(K9:K17)","v":0},{"$f":"SUM(L9:L17)","v":0},{"$f":"SUM(H8:L8)","v":2250000},null,{"$f":"SUM(O9:O17)","v":0},{"$f":"SUM(P9:P17)","v":0},{"$f":"SUM(Q9:Q17)","v":0},{"$f":"SUM(R9:R17)","v":0},{"$f":"SUM(S9:S17)","v":0},{"$f":"SUM(O8:S8)","v":0},null,{"$f":"SUM(V9:V17)","v":430854.5},{"$f":"SUM(W9:W17)","v":1492892},{"$f":"SUM(X9:X17)","v":326253.5},{"$f":"SUM(Y9:Y17)","v":0},{"$f":"SUM(Z9:Z17)","v":0},{"$f":"SUM(V8:Z8)","v":2250000},null,{"$f":"SUM(AC9:AC17)","v":430854.5},{"$f":"SUM(AD9:AD17)","v":1492892},{"$f":"SUM(AE9:AE17)","v":326253.5},{"$f":"SUM(AF9:AF17)","v":0},{"$f":"SUM(AG9:AG17)","v":0},{"$f":"SUM(AC8:AG8)","v":2250000}]
[{"$f":"A22","v":"GR 01: Résultat 1 au niveau global et régional: - Les partenariats entre l’OIT et les acteurs régionaux (CIPRES, UEMOA) sont renforcés et les institutions régionales ont les capacités de soutenir leurs membres dans le renforcement de systèmes de protection sociale et de couverture santé qui soient durables, résistants aux chocs sécuritaires, sanitaires et climatiques, et inclusifs notamment des travailleurs de l'économie informelle."},null,null,null,null,null,null,{"$f":"H22","v":7500},{"$f":"I22","v":45000},2500,{"$f":"K22","v":0},0,55000,null,{"$f":"O22","v":0},{"$f":"P22","v":0},0,{"$f":"R22","v":0},0,0,null,{"$f":"V22","v":7500},{"$f":"W22","v":45000},2500,{"$f":"Y22","v":0},0,{"$f":"SUM(V9:Z9)","v":55000},null,{"$f":"AC22","v":7500},{"$f":"AD22","v":45000},2500,{"$f":"AF22","v":0},0,{"$f":"SUM(AC9:AG9)","v":55000}]
[{"$f":"A48","v":"BF 01:  Résultat 1 Burkina Faso. - Les parties prenantes disposent des informations nécessaires et de capacités renforcées pour déterminer et valider l’architecture et les paramètres du régime d’assurance maladie universelle."},null,null,null,null,null,null,{"$f":"H48","v":54700},{"$f":"I48","v":60300},5000,{"$f":"K48","v":0},0,120000,null,{"$f":"O48","v":0},{"$f":"P48","v":0},0,{"$f":"R48","v":0},0,0,null,{"$f":"V48","v":54700},{"$f":"W48","v":60300},5000,{"$f":"Y48","v":0},0,{"$f":"SUM(V10:Z10)","v":120000},null,{"$f":"AC48","v":54700},{"$f":"AD48","v":60300},5000,{"$f":"AF48","v":0},0,{"$f":"SUM(AC10:AG10)","v":120000}]
{"$rows_left_out":307}
{"sheet":"Budget Template (2)","index":1,"n_rows":315,"n_cols":34,"rows_kept":315,"cut":false,"hidden":false,"merged":[[305,0,308,0],[297,2,298,2],[313,0,315,2],[285,1,291,1],[292,1,294,1],[295,0,302,0],[297,1,299,1],[300,1,302,1],[303,0,303,6],[239,0,263,0],[264,0,294,0],[266,1,268,1],[269,1,271,1],[272,1,275,1],[276,1,278,1],[279,1,281,1],[282,1,284,1],[304,0,304,6],[220,0,236,0],[220,1,220,6],[222,1,224,1],[225,1,227,1],[228,1,230,1],[231,1,233,1],[234,1,236,1],[237,0,237,6],[238,0,238,6],[194,0,194,6],[195,0,195,6],[196,0,196,6],[197,0,219,0],[197,1,197,6],[199,1,201,1],[202,1,204,1],[205,1,207,1],[208,1,210,1],[211,1,213,1],[214,1,216,1],[217,1,219,1],[175,0,193,0],[175,1,175,6],[177,1,179,1],[180,1,182,1],[183,1,185,1],[186,1,188,1],[189,1,193,1],[158,0,158,6],[159,0,159,6],[160,0,160,6],[161,0,174,0],[161,1,161,6],[163,1,165,1],[166,1,168,1],[169,1,171,1],[172,1,174,1],[142,0,149,0],[142,1,142,6],[144,1,146,1],[147,1,149,1],[150,0,157,0],[150,1,150,6],[152,1,154,1],[155,1,157,1],[128,0,141,0],[128,1,128,6],[130,1,132,1],[133,1,135,1],[136,1,138,1],[139,1,141,1],[117,0,117,6],[118,0,118,6],[119,0,119,6],[120,0,127,0],[120,1,120,6],[122,1,124,1],[125,1,127,1],[100,0,116,0],[100,1,100,6],[102,1,104,1],[105,1,107,1],[108,1,110,1],[111,1,113,1],[114,1,116,1],[81,0,81,6],[82,0,82,6],[83,0,99,0],[83,1,83,6],[85,1,87,1],[88,1,90,1],[91,1,93,1],[94,1,96,1],[97,1,99,1],[69,0,79,0],[69,1,69,6],[71,1,73,1],[74,1,76,1],[77,1,79,1],[80,0,80,6],[47,0,47,6],[48,0,48,6],[49,0,68,0],[49,1,49,6],[51,1,54,1],[55,1,57,1],[58,1,60,1],[61,1,63,1],[64,1,68,1],[31,0,38,0],[31,1,31,6],[33,1,35,1],[36,1,38,1],[39,0,46,0],[39,1,39,6],[41,1,43,1],[44,1,46,1],[21,0,21,6],[22,0,22,6],[23,0,30,0],[23,1,23,6],[25,1,27,1],[28,1,30,1],[19,28,20,28],[19,29,20,29],[19,30,20,30],[19,31,20,31],[19,32,20,32],[19,33,20,33],[19,21,20,21],[19,22,20,22],[19,23,20,23],[19,24,20,24],[19,25,20,25],[19,26,20,26],[1,2,1,9],[5,7,5,12],[5,14,5,19],[14,0,14,3],[15,0,15,3],[16,0,16,1],[16,4,16,6],[17,0,17,3],[19,0,20,0],[19,1,20,1],[19,4,20,5],[19,6,20,6],[19,14,20,14],[19,15,20,15],[19,16,20,16],[19,17,20,17],[19,18,20,18],[19,19,20,19],[19,7,20,7],[19,8,20,8],[19,9,20,9],[19,10,20,10],[19,11,20,11],[19,12,20,12],[5,21,5,26],[5,28,5,33],[7,0,7,3],[8,0,8,3],[9,0,9,3],[10,0,10,3],[11,0,11,4],[12,0,12,4],[13,0,13,4]]}
["Award No.","502###"]
["PSC Rate",{"$f":"VLOOKUP(B308,'BL & PSC Rates'!A$2:C$7,2,FALSE)","v":0.13}]
["Project Number","107###"]
["XB Symbol","GLO/20/29/BEL "]
["Budget Version","V.01.00"]
[null,null,null,null,null,null,null,"Working (Draft) Budget",null,null,null,null,null,null,"Current/Baselined  Budget",null,null,null,null,null,null,"Comparison (Working Budget - Current/Baselined Budget)",null,null,null,null,null,null,"Budget to be entered in OGA"]
["Task Number",null,null,null,null,null,null,2020,{"$f":"H7+1","v":2021},{"$f":"I7+1","v":2022},2023,2024,"Total",null,{"$f":"H7","v":2020},{"$f":"I7","v":2021},{"$f":"J7","v":2022},{"$f":"K7","v":2023},2024,"Total",null,{"$f":"O7","v":2020},{"$f":"P7","v":2021},2022,2023,2024,"Total",null,{"$f":"V7","v":2020},{"$f":"W7","v":2021},2022,2023,2024,"Total"]
["Total Project Level",null,null,null,null,null,null,{"$f":"SUM(H9:H17)","v":379151.95878671377},{"$f":"SUM(I9:I17)","v":1313744.9557960164},{"$f":"SUM(J9:J17)","v":287103.0790812702},{"$f":"SUM(K9:K17)","v":0},{"$f":"SUM(L9:L17)","v":0},{"$f":"ROUNDUP(SUM(H8:L8),0)","v":1980000},null,{"$f":"SUM(O9:O17)","v":0},{"$f":"SUM(P9:P17)","v":0},{"$f":"SUM(Q9:Q17)","v":0},{"$f":"SUM(R9:R17)","v":0},{"$f":"SUM(S9:S17)","v":0},{"$f":"SUM(O8:S8)","v":0},null,{"$f":"SUM(V9:V17)","v":430854.5},{"$f":"SUM(W9:W17)","v":1540092},{"$f":"SUM(X9:X17)","v":279053.5},{"$f":"SUM(Y9:Y17)","v":0},{"$f":"SUM(Z9:Z17)","v":0},{"$f":"SUM(V8:Z8)","v":2250000},null,{"$f":"SUM(AC9:AC17)","v":430854.5},{"$f":"SUM(AD9:AD17)","v":1540092},{"$f":"SUM(AE9:AE17)","v":279053.5},{"$f":"SUM(AF9:AF17)","v":0},{"$f":"SUM(AG9:AG17)","v":0},{"$f":"SUM(AC8:AG8)","v":2250000}]
[{"$f":"A22","v":"GR 01: Résultat 1 au niveau global et régional: - Les partenariats entre l’OIT et les acteurs régionaux (CIPRES, UEMOA) sont renforcés et les institutions régionales ont les capacités de soutenir leurs membres dans le renforcement de systèmes de protection sociale et de couverture santé qui soient durables, résistants aux chocs sécuritaires, sanitaires et climatiques, et inclusifs notamment des travailleurs de l'économie informelle."},null,null,null,null,null,null,{"$f":"'Budget Template'!H9/'Budget Template'!$C$312","v":6599.9999788800005},{"$f":"'Budget Template'!I9/'Budget Template'!$C$312","v":39599.999873280001},{"$f":"'Budget Template'!J9/'Budget Template'!$C$312","v":2199.9999929600003},{"$f":"K22","v":0},0,{"$f":"SUM(H9:L9)","v":48399.999845120001},null,{"$f":"O22","v":0},{"$f":"P22","v":0},0,0,0,0,null,{"$f":"V22","v":7500},45000,2500,0,0,{"$f":"SUM(V9:Z9)","v":55000},null,{"$f":"AC22","v":7500},45000,2500,0,0,{"$f":"SUM(AC9:AG9)","v":55000}]
[{"$f":"A48","v":"BF 01:  Résultat 1 Burkina Faso. - Les parties prenantes disposent des informations nécessaires et de capacités renforcées pour déterminer et valider l’architecture et les paramètres du régime d’assurance maladie universelle."},null,null,null,null,null,null,{"$f":"'Budget Template'!H10/'Budget Template'!$C$312","v":48135.999845964805},{"$f":"'Budget Template'!I10/'Budget Template'!$C$312","v":53063.999830195207},{"$f":"'Budget Template'!J10/'Budget Template'!$C$312","v":4399.9999859200007},{"$f":"K48","v":0},0,105599.99966208002,null,{"$f":"O48","v":0},{"$f":"P48","v":0},0,0,0,0,null,{"$f":"V48","v":54700},60300,5000,0,0,{"$f":"SUM(V10:Z10)","v":120000},null,{"$f":"AC48","v":54700},60300,5000,0,0,{"$f":"SUM(AC10:AG10)","v":120000}]
{"$rows_left_out":306}
{"sheet":"BL & PSC Rates","index":2,"n_rows":7,"n_cols":3,"rows_kept":7,"cut":false,"hidden":false,"merged":[]}
["PSC BL","PSC Rate"]
["068.001",0.13,"If a waiver has been requested and approved by the TREASURER, please select a different rate at Outcome 06 (06.01.01. PSC)"]
["067.001","Enter approved PSC rate on TAB 'BL & PSC Rates'","Waiver should be obtained before submitting budget to the donor"]
["065.001",0.05,"Waiver should be obtained before submitting budget to the donor"]
["064.001",0.12,"Waiver should be obtained before submitting budget to the donor"]
["062.001",7.0000000000000007E-2,"Waiver should be obtained before submitting budget to the donor"]
["061.001",0.14000000000000001,"Waiver should be obtained before submitting budget to the donor"]

{"sheet":"How to \"Add Resource Line\"","index":3,"n_rows":72,"n_cols":17,"rows_kept":72,"cut":false,"hidden":false,"merged":[]}
[]
["Select whole row where you need the additional line"]
["Do not select the fist line under the Activity, this to avoid loosing the borders layout"]
[]
[]
[]
[]
[]
[]
[]
{"$rows_left_out":63}
{"sheet":"How to \"Add New Activity\"","index":4,"n_rows":66,"n_cols":16,"rows_kept":66,"cut":false,"hidden":false,"merged":[[65,15,73,18]]}
[]
["Select the whole row where you need the additional activity"]
["Always select the fist line of an Activity, never a line in the middle."]
[]
[]
[]
[]
[]
[]
[]
{"$rows_left_out":57}
{"sheet":"How to \"Add New Output\"","index":5,"n_rows":68,"n_cols":32,"rows_kept":68,"cut":false,"hidden":false,"merged":[[18,31,19,34],[67,15,71,18]]}
[]
["You should always add the additional/new Output under the Outcome where it is required"]
["You shoud select the top line of an existing Output in that Outcome, never select a line in the middle of another Output"]
[]
[]
[]
[]
[]
[]
[]
{"$rows_left_out":59}
{"sheet":"How to \"Delete Line(s)\"","index":6,"n_rows":72,"n_cols":1,"rows_kept":72,"cut":false,"hidden":false,"merged":[]}
[]
["Select the line, or lines, that you need to delete. "]
["If a whole Activity or Output needs to be deleted, it is better to select the entire Activity or Output."]
["CAUTION: You cannot undo this action."]
["Never delete an Outcome as this will break the PSC formulas"]
[]
[]
[]
[]
[]
{"$rows_left_out":63}
{"sheet":"ADD_RES_LINE","index":7,"n_rows":5,"n_cols":34,"rows_kept":5,"cut":false,"hidden":false,"merged":[[1,17,2,17],[1,10,2,10],[1,16,2,16],[1,0,2,0],[1,1,2,1],[1,4,2,5],[1,6,2,6],[1,7,2,7],[1,8,2,8],[1,9,2,9],[1,11,2,11],[1,12,2,12],[1,14,2,14],[1,15,2,15],[1,33,2,33],[1,18,2,18],[1,19,2,19],[1,21,2,21],[1,22,2,22],[1,23,2,23],[1,24,2,24],[1,26,2,26],[1,28,2,28],[1,29,2,29],[1,30,2,30],[1,31,2,31],[1,32,2,32],[1,25,2,25]]}
[]
["Output","Activity","Inputs","Type","Unit rate",null,"Quantity",{"$f":"'Budget Template'!H7","v":2020},{"$f":"'Budget Template'!I7","v":2021},{"$f":"'Budget Template'!J7","v":2022},{"$f":"'Budget Template'!K7","v":2023},{"$f":"'Budget Template'!L7","v":2024},"Total",null,{"$f":"'Budget Template'!O7","v":2020},{"$f":"'Budget Template'!P7","v":2021},{"$f":"'Budget Template'!Q7","v":2022},{"$f":"'Budget Template'!R7","v":2023},{"$f":"'Budget Template'!S7","v":2024},"Total",null,{"$f":"'Budget Template'!V7","v":2020},{"$f":"'Budget Template'!W7","v":2021},{"$f":"'Budget Template'!X7","v":2022},{"$f":"'Budget Template'!Y7","v":2023},{"$f":"'Budget Template'!Z7","v":2024},"Total",null,{"$f":"'Budget Template'!AC7","v":2020},{"$f":"'Budget Template'!AD7","v":2021},{"$f":"'Budget Template'!AE7","v":2022},{"$f":"'Budget Template'!AF7","v":2023},{"$f":"'Budget Template'!AG7","v":2024},"Total"]
[null,null,"(Assumptions)","Resource type* (IRIS)"]
[]
[null,null,null,null,null,null,null,null,null,null,null,null,{"$f":"SUM(H5:L5)","v":0},null,null,null,null,null,null,null,null,{"$f":"H5-O5","v":0},{"$f":"I5-P5","v":0},{"$f":"J5-Q5","v":0},{"$f":"K5-R5","v":0},{"$f":"L5-S5","v":0},{"$f":"SUM(V5:Z5)","v":0},null,{"$f":"IF(H5=O5,\"\",IF(H5>O5,H5,-H5))","v":""},{"$f":"IF(I5=P5,\"\",IF(I5>P5,I5,-I5))","v":""},"","","",{"$f":"IF(COUNT(AC5:AG5)=0,\"\",M5)","v":""}]

{"sheet":"ADD_ACTIVITY","index":8,"n_rows":7,"n_cols":34,"rows_kept":7,"cut":false,"hidden":false,"merged":[[1,24,2,24],[1,17,2,17],[1,10,2,10],[1,33,2,33],[1,25,2,25],[1,26,2,26],[1,28,2,28],[1,29,2,29],[1,30,2,30],[1,32,2,32],[1,31,2,31],[1,23,2,23],[1,15,2,15],[1,16,2,16],[1,18,2,18],[1,19,2,19],[1,21,2,21],[1,22,2,22],[1,7,2,7],[4,1,6,1],[1,0,2,0],[1,1,2,1],[1,4,2,5],[1,6,2,6],[1,8,2,8],[1,9,2,9],[1,11,2,11],[1,12,2,12],[1,14,2,14]]}
[]
["Output","Activity","Inputs","Type","Unit rate",null,"Quantity",{"$f":"'Budget Template'!H7","v":2020},{"$f":"'Budget Template'!I7","v":2021},{"$f":"'Budget Template'!J7","v":2022},{"$f":"'Budget Template'!K7","v":2023},{"$f":"'Budget Template'!L7","v":2024},"Total",null,{"$f":"'Budget Template'!O7","v":2020},{"$f":"'Budget Template'!P7","v":2021},{"$f":"'Budget Template'!Q7","v":2022},{"$f":"'Budget Template'!R7","v":2023},{"$f":"'Budget Template'!S7","v":2024},"Total",null,{"$f":"'Budget Template'!V7","v":2020},{"$f":"'Budget Template'!W7","v":2021},{"$f":"'Budget Template'!X7","v":2022},{"$f":"'Budget Template'!Y7","v":2023},{"$f":"'Budget Template'!Z7","v":2024},"Total",null,{"$f":"'Budget Template'!AC7","v":2020},{"$f":"'Budget Template'!AD7","v":2021},{"$f":"'Budget Template'!AE7","v":2022},{"$f":"'Budget Template'!AF7","v":2023},{"$f":"'Budget Template'!AG7","v":2024},"Total"]
[null,null,"(Assumptions)","Resource type* (IRIS)"]
[]
[null,"0",null,null,null,null,null,null,null,null,null,null,{"$f":"SUM(H5:L5)","v":0},null,null,null,null,null,null,null,null,{"$f":"H5-O5","v":0},{"$f":"I5-P5","v":0},0,0,0,{"$f":"SUM(V5:Z5)","v":0},null,{"$f":"IF(H5=O5,\"\",IF(H5>O5,H5,-H5))","v":""},{"$f":"IF(I5=P5,\"\",IF(I5>P5,I5,-I5))","v":""},"","","",{"$f":"IF(COUNT(AC5:AG5)=0,\"\",M5)","v":""}]
[null,null,null,null,null,null,null,null,null,null,null,null,{"$f":"SUM(H6:L6)","v":0},null,null,null,null,null,null,null,null,{"$f":"H6-O6","v":0},0,0,0,0,{"$f":"SUM(V6:Z6)","v":0},null,{"$f":"IF(H6=O6,\"\",IF(H6>O6,H6,-H6))","v":""},"","","","",{"$f":"IF(COUNT(AC6:AG6)=0,\"\",M6)","v":""}]
[null,null,null,null,null,null,null,null,null,null,null,null,{"$f":"SUM(H7:L7)","v":0},null,null,null,null,null,null,null,null,{"$f":"H7-O7","v":0},0,0,0,0,{"$f":"SUM(V7:Z7)","v":0},null,{"$f":"IF(H7=O7,\"\",IF(H7>O7,H7,-H7))","v":""},"","","","",{"$f":"IF(COUNT(AC7:AG7)=0,\"\",M7)","v":""}]

{"sheet":"ADD_OUTPUT","index":9,"n_rows":18,"n_cols":34,"rows_kept":18,"cut":false,"hidden":false,"merged":[[1,17,2,17],[1,24,2,24],[1,31,2,31],[1,16,2,16],[1,0,2,0],[1,1,2,1],[1,4,2,5],[1,6,2,6],[1,7,2,7],[1,8,2,8],[1,9,2,9],[1,11,2,11],[1,12,2,12],[1,14,2,14],[1,15,2,15],[1,10,2,10],[1,33,2,33],[1,18,2,18],[1,19,2,19],[1,21,2,21],[1,22,2,22],[1,23,2,23],[1,25,2,25],[1,26,2,26],[1,28,2,28],[1,29,2,29],[1,30,2,30],[1,32,2,32],[4,0,17,0],[4,1,4,6],[6,1,8,1],[9,1,11,1],[12,1,14,1],[15,1,17,1]]}
[]
["Output","Activity","Inputs","Type","Unit rate",null,"Quantity",{"$f":"'Budget Template'!H7","v":2020},{"$f":"'Budget Template'!I7","v":2021},{"$f":"'Budget Template'!J7","v":2022},{"$f":"'Budget Template'!K7","v":2023},{"$f":"'Budget Template'!L7","v":2024},"Total",null,{"$f":"'Budget Template'!O7","v":2020},{"$f":"'Budget Template'!P7","v":2021},{"$f":"'Budget Template'!Q7","v":2022},{"$f":"'Budget Template'!R7","v":2023},{"$f":"'Budget Template'!S7","v":2024},"Total",null,{"$f":"'Budget Template'!V7","v":2020},{"$f":"'Budget Template'!W7","v":2021},{"$f":"'Budget Template'!X7","v":2022},{"$f":"'Budget Template'!Y7","v":2023},{"$f":"'Budget Template'!Z7","v":2024},"Total",null,{"$f":"'Budget Template'!AC7","v":2020},{"$f":"'Budget Template'!AD7","v":2021},{"$f":"'Budget Template'!AE7","v":2022},{"$f":"'Budget Template'!AF7","v":2023},{"$f":"'Budget Template'!AG7","v":2024},"Total"]
[null,null,"(Assumptions)","Resource type* (IRIS)"]
[]
["0",null,null,null,null,null,null,{"$f":"SUM(H6:H18)","v":0},{"$f":"SUM(I6:I18)","v":0},{"$f":"SUM(J6:J18)","v":0},0,0,{"$f":"SUM(H5:L5)","v":0},null,null,null,null,null,null,null,null,{"$f":"SUM(V6:V18)","v":0},{"$f":"SUM(W6:W18)","v":0},{"$f":"SUM(X6:X18)","v":0},0,0,{"$f":"SUM(V5:Z5)","v":0},null,{"$f":"IF(COUNT(AC6:AC18)=0,\"\",H5)","v":""},{"$f":"IF(COUNT(AD6:AD18)=0,\"\",I5)","v":""},{"$f":"IF(COUNT(AE6:AE18)=0,\"\",J5)","v":""},{"$f":"IF(COUNT(AF6:AF18)=0,\"\",K5)","v":""},{"$f":"IF(COUNT(AG6:AG18)=0,\"\",L5)","v":""},{"$f":"IF(COUNT(AC5:AG5)=0,\"\",M5)","v":""}]
[null,null,"DO NOT DELETE LINE"]
[null,"0",null,null,null,null,null,null,null,null,null,null,{"$f":"SUM(H7:L7)","v":0},null,null,null,null,null,null,null,null,{"$f":"H7-O7","v":0},{"$f":"I7-P7","v":0},0,0,0,{"$f":"SUM(V7:Z7)","v":0},null,{"$f":"IF(H7=O7,\"\",IF(H7>O7,H7,-H7))","v":""},{"$f":"IF(I7=P7,\"\",IF(I7>P7,I7,-I7))","v":""},"","","",{"$f":"IF(COUNT(AC7:AG7)=0,\"\",M7)","v":""}]
[null,null,null,null,null,null,null,null,null,null,null,null,{"$f":"SUM(H8:L8)","v":0},null,null,null,null,null,null,null,null,0,0,0,0,0,{"$f":"SUM(V8:Z8)","v":0},null,"","","","","",""]
[null,null,null,null,null,null,null,null,null,null,null,null,{"$f":"SUM(H9:L9)","v":0},null,null,null,null,null,null,null,null,0,0,0,0,0,0,null,"","","","","",""]
[null,"0",null,null,null,null,null,null,null,null,null,null,{"$f":"SUM(H10:L10)","v":0},null,null,null,null,null,null,null,null,0,0,0,0,0,0,null,"","","","","",""]
{"$rows_left_out":9}
{"sheet":"Resource Type (budgeting)","index":10,"n_rows":59,"n_cols":4,"rows_kept":59,"cut":false,"hidden":false,"merged":[]}
["Resource Categories","Resource Category Description","Resource Type (budgeting)","Resource Type Description"]
["010_ILO_INTERNATIONAL_STAFF","International Professional Staff","512100_ILO_EXPERTS_COSTS","Standard Costs for International Experts"]
["010_ILO_INTERNATIONAL_STAFF","International Professional Staff","512124_DSA_ST_STAFF","Daily Subsistence Allowance for Short-Term staff"]
["010_ILO_INTERNATIONAL_STAFF","International Professional Staff","515129_MISCELLANEOUS_PERSONNEL","Miscellaneous Personnel Costs"]
["010_ILO_INTERNATIONAL_STAFF","International Professional Staff","518202_ILO_EXPERTS_SST","Special Short-Term Contracts Int. Staff"]
["015_INT_CONSULTANTS","International Consultants","514175_INT_CONSULTANTS","International Consultants"]
["020_ILO_LOCAL_STAFF","Local Support Staff","518100_ADMIN_COST_AT_ACTUAL","Administrative support costs - salaries - Budget"]
["020_ILO_LOCAL_STAFF","Local Support Staff","518201_SST_CONTRACTS_GS_STAFF","Special Short Term - Contracts / General Service Staff"]
["024_NAT_OFFICERS","National Professional Staff","518115_NATIONAL_OFFICERS","National Officer based on Actuals"]
["025_NAT_CONSULTANTS","National Consultants","514170_NAT_CONSULTANTS","National Consultants"]
{"$rows_left_out":49}